Target
Peroxisome proliferator-activated receptor gamma
Ligand
BDBM50179230
Substrate
Meas. Tech.
ChEMBL_325380 (CHEMBL861060)
EC50
5900±n/a nM
Citation
 Mahindroo, NHuang, CFPeng, YHWang, CCLiao, CCLien, TWChittimalla, SKHuang, WJChai, CHPrakash, EChen, CPHsu, TAPeng, CHLu, ILLee, LHChang, YWChen, WCChou, YCChen, CTGoparaju, CMChen, YSLan, SJYu, MCChen, XChao, YSWu, SYHsieh, HP Novel indole-based peroxisome proliferator-activated receptor agonists: design, SAR, structural biology, and biological activities. J Med Chem 48:8194-208 (2005)  
Target
Name:
Peroxisome proliferator-activated receptor gamma
Synonyms:
NR1C3 PPAR-gamma PPARG_HUMAN Peroxisome proliferator-activated receptor gamma (PPAR gamma) Peroxisome proliferator-activated receptor gamma (PPARĪ³) peroxisome proliferator-activated receptor gamma isoform 2
Type:
Nuclear Receptor
Mol. Mass.:
57613.46
Organism:
Homo sapiens (Human)
Description:
P37231
Residue:
505
  
Inhibitor
Name:
BDBM50179230
Synonyms:
2-ethyl-2-{5-[3-(7-propyl-3-trifluoromethylbenzo[d]isoxazol-6-yloxy)propoxy]-1H-indol-1-yl}ethanoic acid | CHEMBL197527
Type:
Small organic molecule
Emp. Form.:
C26H27F3N2O5
Mol. Mass.:
504.4982
SMILES:
CCCc1c(OCCCOc2ccc3n(ccc3c2)C(CC)C(O)=O)ccc2c(noc12)C(F)(F)F
: