Target
Peroxisome proliferator-activated receptor alpha
Ligand
BDBM50179231
Substrate
Meas. Tech.
ChEMBL_325381 (CHEMBL861061)
EC50
474±n/a nM
Citation
 Mahindroo, NHuang, CFPeng, YHWang, CCLiao, CCLien, TWChittimalla, SKHuang, WJChai, CHPrakash, EChen, CPHsu, TAPeng, CHLu, ILLee, LHChang, YWChen, WCChou, YCChen, CTGoparaju, CMChen, YSLan, SJYu, MCChen, XChao, YSWu, SYHsieh, HP Novel indole-based peroxisome proliferator-activated receptor agonists: design, SAR, structural biology, and biological activities. J Med Chem 48:8194-208 (2005)  
Target
Name:
Peroxisome proliferator-activated receptor alpha
Synonyms:
NR1C1 PPAR PPAR-alpha PPARA_HUMAN Peroxisome proliferator-activated receptor | Peroxisome proliferator-activated receptor alpha (PPAR alpha)
Type:
Enzyme
Mol. Mass.:
52222.08
Organism:
Homo sapiens (Human)
Description:
Q07869
Residue:
468
  
Inhibitor
Name:
BDBM50179231
Synonyms:
CHEMBL198929 | {5-[3-(7-propyl-3-trifluoromethylbenzo[d]isoxazol-6-yloxy)propoxy]indol-1-yl}(2H-tetrazol-5-yl)methane
Type:
Small organic molecule
Emp. Form.:
C24H23F3N6O3
Mol. Mass.:
500.473
SMILES:
CCCc1c(OCCCOc2ccc3n(Cc4nnn[nH]4)ccc3c2)ccc2c(noc12)C(F)(F)F
: