Target
Melanocortin receptor 4
Ligand
BDBM50179459
Substrate
Meas. Tech.
ChEMBL_339211 (CHEMBL866558)
Ki
104±n/a nM
Citation
 Tian, XChen, XGan, LHayes, JCSwitzer, AGSolinsky, MGEbetino, FHWos, JAPinney, BBFarmer, JACrossdoersen, DSheldon, RJ Synthesis of Tic-D-Phe Psi[CH2-CH2] isostere and its use in the development of melanocortin receptor agonists. Bioorg Med Chem Lett 16:1721-5 (2006)  
Target
Name:
Melanocortin receptor 4
Synonyms:
MC4-R MC4R_HUMAN Melanocortin receptor 4 (MC-4) Melanocortin receptor 4 (MC4R)
Type:
Enzyme
Mol. Mass.:
36949.50
Organism:
Homo sapiens (Human)
Description:
P32245
Residue:
332
  
Inhibitor
Name:
BDBM50179459
Synonyms:
(S)-2-{(R)-2-[(S)-2-acetylamino-3-(4-hydroxy-phenyl)-propionylamino]-3-phenyl-propionylamino}-5-guanidino-pentanoic acid ((S)-1-methylcarbamoyl-2-naphthalen-2-yl-ethyl)-amide CHEMBL202699
Type:
Small organic molecule
Emp. Form.:
C40H48N8O6
Mol. Mass.:
736.8591
SMILES:
[#6]-[#7]-[#6](=O)-[#6@H](-[#6]-c1ccc2ccccc2c1)-[#7]-[#6](=O)-[#6@H](-[#6]-[#6]-[#6]\[#7]=[#6](\[#7])-[#7])-[#7]-[#6](=O)-[#6@@H](-[#6]-c1ccccc1)-[#7]-[#6](=O)-[#6@H](-[#6]-c1ccc(-[#8])cc1)-[#7]-[#6](-[#6])=O
: