Target
Metabotropic glutamate receptor 5
Ligand
BDBM50179654
Substrate
Meas. Tech.
ChEMBL_335665 (CHEMBL860565)
IC50
180±n/a nM
Citation
 Wållberg, ANilsson, KOsterlund, KPeterson, AElg, SRaboisson, PBauer, UHammerland, LGMattsson, JP Phenyl ureas of creatinine as mGluR5 antagonists. A structure-activity relationship study of fenobam analogues. Bioorg Med Chem Lett 16:1142-5 (2006)  
Target
Name:
Metabotropic glutamate receptor 5
Synonyms:
GRM5_RAT Grm5 Mglur5 metabotropic glutamate 5/1-C metabotropic glutamate 5a
Type:
Enzyme
Mol. Mass.:
131900.14
Organism:
Rattus norvegicus (Rat)
Description:
P31424
Residue:
1203
  
Inhibitor
Name:
BDBM50179654
Synonyms:
1-(3-chlorophenyl)-3-(1-ethyl-4-oxoimidazolidin-2-ylidene)urea | CHEMBL202794
Type:
Small organic molecule
Emp. Form.:
C12H13ClN4O2
Mol. Mass.:
280.71
SMILES:
CCn1cc(O)nc1NC(=O)Nc1cccc(Cl)c1
: