Target
Calpain small subunit 1/1 catalytic subunit
Ligand
BDBM50179742
Substrate
Meas. Tech.
ChEMBL_340807 (CHEMBL867681)
IC50
905±n/a nM
Citation
 Auvin, SPignol, BNavet, ETroadec, MCarré, DCamara, JBigg, DChabrier, PE Novel dual inhibitors of calpain and lipid peroxidation with enhanced cellular activity. Bioorg Med Chem Lett 16:1586-9 (2006)  
Target
Name:
Calpain small subunit 1/1 catalytic subunit
Synonyms:
Calpain 1 | Calpain 1/small subunit 1
Type:
Mol. Mass.:
Description:
ASSAY_ID of EBI is 43671
Components:
This complex has 2 components.
Component 1
Name:
Calpain small subunit 1
Synonyms:
CAPN4 CAPNS1 Calpain 1
Type:
PROTEIN
Mol. Mass.:
28309.36
Organism:
Homo sapiens (Human)
Description:
EBI_12682
Residue:
268
  
Component 2
Name:
Calpain-1 catalytic subunit
Synonyms:
CAN1_HUMAN CAPN1 Calpain-1 (u-Calpain) Calpain1
Type:
Protein
Mol. Mass.:
81880.51
Organism:
Homo sapiens (Human)
Description:
Residue:
714
  
Inhibitor
Name:
BDBM50179742
Synonyms:
(3S)-3-((S)-4-methyl-2-((S)-4-methyl-2-(10H-phenothiazine-2-carboxamido)pentanamido)pentanamido)-tetrahydrofuran-2-yl acetate | CHEMBL206571
Type:
Small organic molecule
Emp. Form.:
C31H40N4O6S
Mol. Mass.:
596.738
SMILES:
CC(C)C[C@H](NC(=O)[C@H](CC(C)C)NC(=O)c1ccc2Sc3ccccc3Nc2c1)C(=O)N[C@H]1CCOC1OC(C)=O
: