Target
Peroxisome proliferator-activated receptor gamma
Ligand
BDBM50179816
Substrate
Meas. Tech.
ChEMBL_339276 (CHEMBL867229)
IC50
3610±n/a nM
Citation
 Desai, RCMetzger, ESantini, CMeinke, PTHeck, JVBerger, JPMacNaul, KLCai, TQWright, SDAgrawal, AMoller, DESahoo, SP Design and synthesis of potent and subtype-selective PPARalpha agonists. Bioorg Med Chem Lett 16:1673-8 (2006)  
Target
Name:
Peroxisome proliferator-activated receptor gamma
Synonyms:
NR1C3 PPAR-gamma PPARG_HUMAN Peroxisome proliferator-activated receptor gamma (PPAR gamma) Peroxisome proliferator-activated receptor gamma (PPARĪ³) peroxisome proliferator-activated receptor gamma isoform 2
Type:
Nuclear Receptor
Mol. Mass.:
57613.46
Organism:
Homo sapiens (Human)
Description:
P37231
Residue:
505
  
Inhibitor
Name:
BDBM50179816
Synonyms:
(S)-2-(4-(3-(2-chloro-4-(4,4-dimethylcyclohexyl)phenoxy)propoxy)benzyl)-2-methylbutanoic acid | CHEMBL202739
Type:
Small organic molecule
Emp. Form.:
C29H39ClO4
Mol. Mass.:
487.071
SMILES:
CC[C@@](C)(Cc1ccc(OCCCOc2ccc(cc2Cl)C2CCC(C)(C)CC2)cc1)C(O)=O
: