Target
Peroxisome proliferator-activated receptor gamma
Ligand
BDBM50179837
Substrate
Meas. Tech.
ChEMBL_339276 (CHEMBL867229)
IC50
6440±n/a nM
Citation
 Desai, RCMetzger, ESantini, CMeinke, PTHeck, JVBerger, JPMacNaul, KLCai, TQWright, SDAgrawal, AMoller, DESahoo, SP Design and synthesis of potent and subtype-selective PPARalpha agonists. Bioorg Med Chem Lett 16:1673-8 (2006)  
Target
Name:
Peroxisome proliferator-activated receptor gamma
Synonyms:
NR1C3 PPAR-gamma PPARG_HUMAN Peroxisome proliferator-activated receptor gamma (PPAR gamma) Peroxisome proliferator-activated receptor gamma (PPARĪ³) peroxisome proliferator-activated receptor gamma isoform 2
Type:
Nuclear Receptor
Mol. Mass.:
57613.46
Organism:
Homo sapiens (Human)
Description:
P37231
Residue:
505
  
Inhibitor
Name:
BDBM50179837
Synonyms:
3-(4-(3-(2-chloro-4-(4-fluorophenoxy)phenoxy)propoxy)phenyl)propanoic acid | CHEMBL204057
Type:
Small organic molecule
Emp. Form.:
C24H22ClFO5
Mol. Mass.:
444.88
SMILES:
OC(=O)CCc1ccc(OCCCOc2ccc(Oc3ccc(F)cc3)cc2Cl)cc1
: