Target
Peroxisome proliferator-activated receptor alpha
Ligand
BDBM50179838
Substrate
Meas. Tech.
ChEMBL_339274 (CHEMBL867227)
IC50
101±n/a nM
Citation
 Desai, RCMetzger, ESantini, CMeinke, PTHeck, JVBerger, JPMacNaul, KLCai, TQWright, SDAgrawal, AMoller, DESahoo, SP Design and synthesis of potent and subtype-selective PPARalpha agonists. Bioorg Med Chem Lett 16:1673-8 (2006)  
Target
Name:
Peroxisome proliferator-activated receptor alpha
Synonyms:
NR1C1 PPAR PPAR-alpha PPARA_HUMAN Peroxisome proliferator-activated receptor | Peroxisome proliferator-activated receptor alpha (PPAR alpha)
Type:
Enzyme
Mol. Mass.:
52222.08
Organism:
Homo sapiens (Human)
Description:
Q07869
Residue:
468
  
Inhibitor
Name:
BDBM50179838
Synonyms:
(S)-2-(4-(3-(2-chloro-4-(4-fluorophenoxy)phenoxy)propoxy)benzyl)-2-methylbutanoic acid | CHEMBL203409
Type:
Small organic molecule
Emp. Form.:
C27H28ClFO5
Mol. Mass.:
486.96
SMILES:
CC[C@@](C)(Cc1ccc(OCCCOc2ccc(Oc3ccc(F)cc3)cc2Cl)cc1)C(O)=O
: