Target
Gamma-aminobutyric acid receptor subunit alpha-3/beta-3/gamma-2
Ligand
BDBM50179925
Substrate
Meas. Tech.
ChEMBL_340230 (CHEMBL863774)
Ki
0.42±n/a nM
Citation
 Jennings, ASLewis, RTRussell, MGHallett, DJStreet, LJCastro, JLAtack, JRCook, SMLincoln, RStanley, JSmith, AJReynolds, DSSohal, BPike, AMarshall, GRWafford, KASheppard, WFTye, SJ Imidazo[1,2-b][1,2,4]triazines as alpha2/alpha3 subtype selective GABA A agonists for the treatment of anxiety. Bioorg Med Chem Lett 16:1477-80 (2006)  
Target
Name:
Gamma-aminobutyric acid receptor subunit alpha-3/beta-3/gamma-2
Synonyms:
GABA receptor alpha-3/beta-3/gamma-2 subunit | GABA-A receptor; alpha-3/beta-3/gamma-2
Type:
Mol. Mass.:
Description:
ASSAY_ID of EBI is 68410
Components:
This complex has 3 components.
Component 1
Name:
Gamma-aminobutyric acid receptor subunit gamma-2
Synonyms:
GABA(A) receptor subunit gamma-2 GBRG2_HUMAN
Type:
PROTEIN
Mol. Mass.:
54172.74
Organism:
Homo sapiens (Human)
Description:
EBI_217
Residue:
467
  
Component 2
Name:
Gamma-aminobutyric acid receptor subunit beta-3
Synonyms:
GABA A receptor alpha-4/beta-3/gamma-2 GABA-A receptor GBRB3_HUMAN | agonist GABA site
Type:
PROTEIN
Mol. Mass.:
54130.51
Organism:
Homo sapiens (Human)
Description:
ChEMBL_448071
Residue:
473
  
Component 3
Name:
Gamma-aminobutyric acid receptor subunit alpha-3
Synonyms:
GABA A Alpha3Beta3Gamma2 GABA C GABA-A receptor GBRA3_HUMAN agonist GABA site
Type:
Enzyme Catalytic Domain
Mol. Mass.:
55175.47
Organism:
Homo sapiens (Human)
Description:
GABA A Alpha3Beta1Gamma2 0 HUMAN::P34903
Residue:
492
  
Inhibitor
Name:
BDBM50179925
Synonyms:
2-(3-(4-fluoro-3-(3-fluoropyridin-2-yl)phenyl)imidazo[1,2-a]pyrimidin-7-yl)propan-2-ol | CHEMBL203315
Type:
Small organic molecule
Emp. Form.:
C20H16F2N4O
Mol. Mass.:
366.364
SMILES:
CC(C)(O)c1ccn2c(cnc2n1)-c1ccc(F)c(c1)-c1ncccc1F
: