Target
D(4) dopamine receptor
Ligand
BDBM50180054
Substrate
Meas. Tech.
ChEMBL_329928 (CHEMBL868789)
Ki
8.5±n/a nM
Citation
 Kumar, JSMajo, VJHsiung, SCMillak, MSLiu, KPTamir, HPrabhakaran, JSimpson, NRVan Heertum, RLMann, JJParsey, RV Synthesis and in vivo validation of [O-methyl-11C]2-{4-[4-(7-methoxynaphthalen-1-yl)piperazin- 1-yl]butyl}-4-methyl-2H-[1,2,4]triazine-3,5-dione: a novel 5-HT1A receptor agonist positron emission tomography ligand. J Med Chem 49:125-34 (2006)  
Target
Name:
D(4) dopamine receptor
Synonyms:
D(2C) dopamine receptor DOPAMINE D4.2 DRD4 Dopamine D4 receptor
Type:
Enzyme
Mol. Mass.:
48373.19
Organism:
Homo sapiens (Human)
Description:
P21917
Residue:
419
  
Inhibitor
Name:
BDBM50180054
Synonyms:
CHEMBL199824 | [O-methyl-11C]2-{4-[4-(7-methoxynaphthalen-1-yl)piperazin-1-yl]butyl}-4-methyl-2H-[1,2,4]triazine-3,5-dione
Type:
Small organic molecule
Emp. Form.:
C23H29N5O3
Mol. Mass.:
423.5081
SMILES:
COc1ccc2cccc(N3CCN(CCCCn4ncc(=O)n(C)c4=O)CC3)c2c1
: