Target
Adenosine receptor A3
Ligand
BDBM50180201
Substrate
Meas. Tech.
ChEMBL_330118 (CHEMBL863398)
Ki
415±n/a nM
Citation
 Jeong, LSLee, HWJacobson, KAKim, HOShin, DHLee, JAGao, ZGLu, CDuong, HTGunaga, PLee, SKJin, DZChun, MWMoon, HR Structure-activity relationships of 2-chloro-N6-substituted-4'-thioadenosine-5'-uronamides as highly potent and selective agonists at the human A3 adenosine receptor. J Med Chem 49:273-81 (2006)  
Target
Name:
Adenosine receptor A3
Synonyms:
A3 adenosine receptor (hA3) ADORA3 | Adenosine A3 receptor (A3AR)
Type:
G Protein-Coupled Receptor (GPCR)
Mol. Mass.:
36197.32
Organism:
Homo sapiens (Human)
Description:
P0DMS8
Residue:
318
  
Inhibitor
Name:
BDBM50180201
Synonyms:
(2S,3S,4R,5R)-5-(2-chloro-6-(methylamino)-9H-purin-9-yl)-N-(3,3-diphenylpropyl)-3,4-dihydroxy-tetrahydrothiophene-2-carboxamide | CHEMBL440215
Type:
Small organic molecule
Emp. Form.:
C26H27ClN6O3S
Mol. Mass.:
539.049
SMILES:
CNc1nc(Cl)nc2n(cnc12)[C@@H]1S[C@@H]([C@@H](O)[C@H]1O)C(=O)NCCC(c1ccccc1)c1ccccc1
: