Target
Adenosine receptor A3
Ligand
BDBM50180203
Substrate
Meas. Tech.
ChEMBL_330118 (CHEMBL863398)
Ki
2.5±n/a nM
Citation
 Jeong, LSLee, HWJacobson, KAKim, HOShin, DHLee, JAGao, ZGLu, CDuong, HTGunaga, PLee, SKJin, DZChun, MWMoon, HR Structure-activity relationships of 2-chloro-N6-substituted-4'-thioadenosine-5'-uronamides as highly potent and selective agonists at the human A3 adenosine receptor. J Med Chem 49:273-81 (2006)  
Target
Name:
Adenosine receptor A3
Synonyms:
A3 adenosine receptor (hA3) ADORA3 | Adenosine A3 receptor (A3AR)
Type:
G Protein-Coupled Receptor (GPCR)
Mol. Mass.:
36197.32
Organism:
Homo sapiens (Human)
Description:
P0DMS8
Residue:
318
  
Inhibitor
Name:
BDBM50180203
Synonyms:
(2S,3S,4R,5R)-5-[2-chloro-6-(2-methyl-benzylamino)-purin-9-yl]-3,4-dihydroxy-tetrahydro-thiophene-2-carboxylic acid ethylamide | CHEMBL200099
Type:
Small organic molecule
Emp. Form.:
C20H23ClN6O3S
Mol. Mass.:
462.953
SMILES:
CCNC(=O)[C@H]1S[C@H]([C@H](O)[C@@H]1O)n1cnc2c(NCc3ccccc3C)nc(Cl)nc12
: