Target
Heat shock protein HSP 90-beta
Ligand
BDBM50165272
Substrate
Meas. Tech.
ChEMBL_329523 (CHEMBL859806)
IC50
365±n/a nM
Citation
 He, HZatorska, DKim, JAguirre, JLlauger, LShe, YWu, NImmormino, RMGewirth, DTChiosis, G Identification of potent water soluble purine-scaffold inhibitors of the heat shock protein 90. J Med Chem 49:381-90 (2006)  
Target
Name:
Heat shock protein HSP 90-beta
Synonyms:
HS90B_HUMAN HSP 90 HSP90B HSPCB Heat shock protein HSP 90 (Hsp90)
Type:
Molecular Chaperone
Mol. Mass.:
83229.45
Organism:
Homo sapiens (Human)
Description:
P08238
Residue:
724
  
Inhibitor
Name:
BDBM50165272
Synonyms:
8-(6-Bromo-benzo[1,3]dioxol-5-ylsulfanyl)-9-pent-4-ynyl-9H-purin-6-ylamine CHEMBL365159 | US10676476, Example 1
Type:
Small organic molecule
Emp. Form.:
C17H14BrN5O2S
Mol. Mass.:
432.294
SMILES:
Nc1ncnc2n(CCCC#C)c(Sc3cc4OCOc4cc3Br)nc12
: