Target
Heat shock protein HSP 90-beta
Ligand
BDBM50180308
Substrate
Meas. Tech.
ChEMBL_329523 (CHEMBL859806)
IC50
90±n/a nM
Citation
 He, HZatorska, DKim, JAguirre, JLlauger, LShe, YWu, NImmormino, RMGewirth, DTChiosis, G Identification of potent water soluble purine-scaffold inhibitors of the heat shock protein 90. J Med Chem 49:381-90 (2006)  
Target
Name:
Heat shock protein HSP 90-beta
Synonyms:
HS90B_HUMAN HSP 90 HSP90B HSPCB Heat shock protein HSP 90 (Hsp90)
Type:
Molecular Chaperone
Mol. Mass.:
83229.45
Organism:
Homo sapiens (Human)
Description:
P08238
Residue:
724
  
Inhibitor
Name:
BDBM50180308
Synonyms:
2-fluoro-8-(6-iodo-benzo[1,3]dioxol-5-ylmethyl)-9-(pent-4-ynyl)adenine US10676476, Example 11
Type:
Small organic molecule
Emp. Form.:
C18H15FIN5O2
Mol. Mass.:
479.2469
SMILES:
Nc1nc(F)nc2n(CCCC#C)c(Cc3cc4OCOc4cc3I)nc12
: