Target
Heat shock protein HSP 90-beta
Ligand
BDBM50180309
Substrate
Meas. Tech.
ChEMBL_329521 (CHEMBL859805)
EC50
4600±n/a nM
Citation
 He, HZatorska, DKim, JAguirre, JLlauger, LShe, YWu, NImmormino, RMGewirth, DTChiosis, G Identification of potent water soluble purine-scaffold inhibitors of the heat shock protein 90. J Med Chem 49:381-90 (2006)  
Target
Name:
Heat shock protein HSP 90-beta
Synonyms:
HS90B_HUMAN HSP 90 HSP90B HSPCB Heat shock protein HSP 90 (Hsp90)
Type:
Molecular Chaperone
Mol. Mass.:
83229.45
Organism:
Homo sapiens (Human)
Description:
P08238
Residue:
724
  
Inhibitor
Name:
BDBM50180309
Synonyms:
2-fluoro-8-(2-chloro-4,5-dimethoxy-benzyl)-9-(pent-4-ynyl)-adenine US10676476, Example 14
Type:
Small organic molecule
Emp. Form.:
C19H19ClFN5O2
Mol. Mass.:
403.838
SMILES:
COc1cc(Cl)c(Cc2nc3c(N)nc(F)nc3n2CCCC#C)cc1OC
: