Target
Platelet-derived growth factor receptor beta
Ligand
BDBM50181313
Substrate
Meas. Tech.
ChEMBL_347373 (CHEMBL865653)
IC50
57±n/a nM
Citation
 Frazier, KJazan, EMcBride, CMPecchi, SRenhowe, PAShafer, CMTaylor, CBussiere, DHe, MMJansen, JMLapointe, GMa, SVora, JWiesmann, M Design and structure-activity relationship of heterocyclic analogs of 4-amino-3-benzimidazol-2-ylhydroquinolin-2-ones as inhibitors of receptor tyrosine kinases. Bioorg Med Chem Lett 16:2247-51 (2006)  
Target
Name:
Platelet-derived growth factor receptor beta
Synonyms:
2.7.10.1 Beta-type platelet-derived growth factor receptor CD140b antigen PDGF-R-beta PDGFR-beta Pdgfr Pdgfrb Platelet-derived growth factor receptor | Platelet-derived growth factor receptor 1
Type:
Enzyme
Mol. Mass.:
122771.00
Organism:
Mus musculus (mouse)
Description:
P05622
Residue:
1098
  
Inhibitor
Name:
BDBM50181313
Synonyms:
4-amino-3-(1H-benzo[d]imidazol-2-yl)-1,7-naphthyridin-2(1H)-one | CHEMBL383618
Type:
Small organic molecule
Emp. Form.:
C15H11N5O
Mol. Mass.:
277.2807
SMILES:
Nc1c(-c2nc3ccccc3[nH]2)c(=O)[nH]c2cnccc12
: