Target
Fructose-1,6-bisphosphatase 1
Ligand
BDBM50181339
Substrate
Meas. Tech.
ChEMBL_345422 (CHEMBL861116)
IC50
2800±n/a nM
Citation
 Lai, CGum, RJDaly, MFry, EHHutchins, CAbad-Zapatero, Cvon Geldern, TW Benzoxazole benzenesulfonamides as allosteric inhibitors of fructose-1,6-bisphosphatase. Bioorg Med Chem Lett 16:1807-10 (2006)  
Target
Name:
Fructose-1,6-bisphosphatase 1
Synonyms:
D-fructose-1,6-bisphosphate 1-phosphohydrolase 1 FBP FBPase 1 Fructose-1,6-bisphosphatase 1 | Fructose-1,6-bisphosphatase 1 (FBPase)
Type:
Protein
Mol. Mass.:
36843.58
Organism:
Homo sapiens (Human)
Description:
Liver FBPase (P09467)
Residue:
338
  
Inhibitor
Name:
BDBM50181339
Synonyms:
CHEMBL381567 | N-(5-chlorobenzo[d]oxazol-2-yl)-4-fluorobenzenesulfonamide
Type:
Small organic molecule
Emp. Form.:
C13H8ClFN2O3S
Mol. Mass.:
326.731
SMILES:
Fc1ccc(cc1)S(=O)(=O)Nc1nc2cc(Cl)ccc2o1
: