Target
ALK tyrosine kinase receptor
Ligand
BDBM50181683
Substrate
Meas. Tech.
ChEMBL_331449 (CHEMBL867052)
IC50
13800±n/a nM
Citation
 Li, RXue, LZhu, TJiang, QCui, XYan, ZMcGee, DWang, JGantla, VRPickens, JCMcGrath, DChucholowski, AMorris, SWWebb, TR Design and synthesis of 5-aryl-pyridone-carboxamides as inhibitors of anaplastic lymphoma kinase. J Med Chem 49:1006-15 (2006)  
Target
Name:
ALK tyrosine kinase receptor
Synonyms:
ALK ALK_HUMAN CD_antigen: CD246
Type:
Protein
Mol. Mass.:
176453.10
Organism:
Homo sapiens (Human)
Description:
Q9UM73
Residue:
1620
  
Inhibitor
Name:
BDBM50181683
Synonyms:
5-benzo[1,3]dioxol-5-yl-2-oxo-1,2-dihydro-pyridine-3-carboxylic acid [2-methoxy-4-(4-methyl-piperazin-1-ylmethyl)-phenyl]-amide | CHEMBL201639
Type:
Small organic molecule
Emp. Form.:
C26H28N4O5
Mol. Mass.:
476.5243
SMILES:
COc1cc(CN2CCN(C)CC2)ccc1NC(=O)c1cc(c[nH]c1=O)-c1ccc2OCOc2c1
: