Target
RNA-directed RNA polymerase
Ligand
BDBM50181730
Substrate
Meas. Tech.
ChEMBL_331786 (CHEMBL864669)
IC50
>30000±n/a nM
Citation
 Powers, JPPiper, DELi, YMayorga, VAnzola, JChen, JMJaen, JCLee, GLiu, JPeterson, MGTonn, GRYe, QWalker, NPWang, Z SAR and mode of action of novel non-nucleoside inhibitors of hepatitis C NS5b RNA polymerase. J Med Chem 49:1034-46 (2006)  
Target
Name:
RNA-directed RNA polymerase
Synonyms:
Hepatitis C virus NS5B RNA-dependent RNA polymerase | NS5B protein
Type:
Protein
Mol. Mass.:
25173.95
Organism:
Hepatitis C virus
Description:
Q8JXU8
Residue:
229
  
Inhibitor
Name:
BDBM50181730
Synonyms:
(Z)-5-(4'-Chlorobenzylidene)-2-thioxothiazolidin-4-one (Z)-5-(4-chlorobenzyliden)-2-thioxothiazolidin-4-one 5-(4-chlorobenzylidene)-4-oxo-2-thionothiazolidine | CHEMBL201467
Type:
Small organic molecule
Emp. Form.:
C10H6ClNOS2
Mol. Mass.:
255.744
SMILES:
SC1=NC(=O)C(S1)=Cc1ccc(Cl)cc1
: