Target
Bcl-2-like protein 1
Ligand
BDBM50181877
Substrate
Meas. Tech.
ChEMBL_332729 (CHEMBL859053)
Ki
1.2±n/a nM
Citation
 Wendt, MDShen, WKunzer, AMcClellan, WJBruncko, MOost, TKDing, HJoseph, MKZhang, HNimmer, PMNg, SCShoemaker, ARPetros, AMOleksijew, AMarsh, KBauch, JOltersdorf, TBelli, BAMartineau, DFesik, SWRosenberg, SHElmore, SW Discovery and structure-activity relationship of antagonists of B-cell lymphoma 2 family proteins with chemopotentiation activity in vitro and in vivo. J Med Chem 49:1165-81 (2006)  
Target
Name:
Bcl-2-like protein 1
Synonyms:
Anti-apoptotic Bcl-2 protein Apoptosis regulator Bcl-X BCL2-like 1 isoform 1 BCL2L1 Bcl-2-like protein 1 (Bcl-XL) Bcl-xL/Bcl-2-binding component 3 Bcl2-antagonist of cell death (BAD)
Type:
Mitochondrion membrane; Single-pass membrane protein
Mol. Mass.:
26039.60
Organism:
Homo sapiens (Human)
Description:
Residue:
233
  
Inhibitor
Name:
BDBM50181877
Synonyms:
4-((R)-5-dimethylamino-1-phenylsulfanylmethylpentylamino)-N-[4-(4,4-dimethylpiperidin-1-yl)benzoyl]-3-nitrobenzenesulfonamide | CHEMBL370835
Type:
Small organic molecule
Emp. Form.:
C34H45N5O5S2
Mol. Mass.:
667.882
SMILES:
CN(C)CCCC[C@H](CSc1ccccc1)Nc1ccc(cc1[N+]([O-])=O)S(=O)(=O)NC(=O)c1ccc(cc1)N1CCC(C)(C)CC1
: