Target
Thioredoxin reductase 1, cytoplasmic/2, mitochondrial/3
Ligand
BDBM50182121
Substrate
Meas. Tech.
ChEMBL_347984 (CHEMBL869603)
IC50
80000±n/a nM
Citation
 Andricopulo, ADAkoachere, MBKrogh, RNickel, CMcLeish, MJKenyon, GLArscott, LDWilliams, CHDavioud-Charvet, EBecker, K Specific inhibitors of Plasmodium falciparum thioredoxin reductase as potential antimalarial agents. Bioorg Med Chem Lett 16:2283-92 (2006)  
Target
Name:
Thioredoxin reductase 1, cytoplasmic/2, mitochondrial/3
Synonyms:
Thioredoxin reductase
Type:
Mol. Mass.:
Description:
ASSAY_ID of ChEMBL is 347984
Components:
This complex has 3 components.
Component 1
Name:
Thioredoxin reductase 2, mitochondrial
Synonyms:
KIAA1652 SelZ TR-beta TRXR2_HUMAN Thioredoxin reductase 2, mitochondrial | Thioredoxin reductase TR3
Type:
PROTEIN
Mol. Mass.:
56364.01
Organism:
Homo sapiens (Human)
Description:
ChEMBL_104858
Residue:
523
  
Component 2
Name:
Thioredoxin reductase 1, cytoplasmic
Synonyms:
GRIM-12 Gene associated with retinoid-IFN-induced mortality 12 protein KM-102-derived reductase-like factor TRXR1_HUMAN Thioredoxin reductase 1 Thioredoxin reductase TR1
Type:
Protein
Mol. Mass.:
70761.78
Organism:
Homo sapiens (Human)
Description:
Q16881
Residue:
648
  
Component 3
Name:
Thioredoxin reductase 3
Synonyms:
TGR TRXR3 TXNRD3 Thioredoxin reductase 3 | Thioredoxin reductase TR2
Type:
PROTEIN
Mol. Mass.:
70543.23
Organism:
Homo sapiens (Human)
Description:
ChEMBL_104858
Residue:
642
  
Inhibitor
Name:
BDBM50182121
Synonyms:
4,5-dinitrobenzo[d][1,3]dioxole | CHEMBL206829
Type:
Small organic molecule
Emp. Form.:
C7H4N2O6
Mol. Mass.:
212.1165
SMILES:
[O-][N+](=O)c1ccc2OCOc2c1[N+]([O-])=O
: