Target
Polyunsaturated fatty acid 5-lipoxygenase
Ligand
BDBM50182300
Substrate
Meas. Tech.
ChEMBL_351710 (CHEMBL870099)
IC50
36±n/a nM
Citation
 Grimm, ELBrideau, CChauret, NChan, CCDelorme, DDucharme, YEthier, DFalgueyret, JPFriesen, RWGuay, JHamel, PRiendeau, DSoucy-Breau, CTagari, PGirard, Y Substituted coumarins as potent 5-lipoxygenase inhibitors. Bioorg Med Chem Lett 16:2528-31 (2006)  
Target
Name:
Polyunsaturated fatty acid 5-lipoxygenase
Synonyms:
5-LO 5-Lipoxygenase (5-LO) 5-Lipoygenase ALOX5 LOG5 | LOX5_HUMAN
Type:
Enzyme
Mol. Mass.:
77972.74
Organism:
Homo sapiens (Human)
Description:
Recombinant protein was purified from E. coli lysate. After ammonium sulfate precipitation and subsequent steps, the supernatant (S100) was used for 5-LO activity assay.
Residue:
674
  
Inhibitor
Name:
BDBM50182300
Synonyms:
7-((3-fluoro-5-((1S,3S,5R)-3-hydroxy-6,8-dioxa-bicyclo[3.2.1]octan-3-yl)phenoxy)methyl)-4-(furan-3-yl)quinoline-2-carbonitrile L-746530
Type:
Small organic molecule
Emp. Form.:
C27H21FN2O5
Mol. Mass.:
472.4644
SMILES:
O[C@]1(C[C@H]2CO[C@@H](C1)O2)c1cc(F)cc(OCc2ccc3c(cc(nc3c2)C#N)-c2ccoc2)c1
: