Target
Polyunsaturated fatty acid 5-lipoxygenase
Ligand
BDBM50182305
Substrate
Meas. Tech.
ChEMBL_351708 (CHEMBL870097)
IC50
175±n/a nM
Citation
 Grimm, ELBrideau, CChauret, NChan, CCDelorme, DDucharme, YEthier, DFalgueyret, JPFriesen, RWGuay, JHamel, PRiendeau, DSoucy-Breau, CTagari, PGirard, Y Substituted coumarins as potent 5-lipoxygenase inhibitors. Bioorg Med Chem Lett 16:2528-31 (2006)  
Target
Name:
Polyunsaturated fatty acid 5-lipoxygenase
Synonyms:
5-LO 5-Lipoxygenase (5-LO) 5-Lipoygenase ALOX5 LOG5 | LOX5_HUMAN
Type:
Enzyme
Mol. Mass.:
77972.74
Organism:
Homo sapiens (Human)
Description:
Recombinant protein was purified from E. coli lysate. After ammonium sulfate precipitation and subsequent steps, the supernatant (S100) was used for 5-LO activity assay.
Residue:
674
  
Inhibitor
Name:
BDBM50182305
Synonyms:
7-((3-fluoro-5-(1-hydroxy-1-(thiazol-2-yl)propyl)phenoxy)methyl)-4-(4-fluorophenyl)-2H-chromen-2-one | CHEMBL205222
Type:
Small organic molecule
Emp. Form.:
C28H21F2NO4S
Mol. Mass.:
505.532
SMILES:
CCC(O)(c1nccs1)c1cc(F)cc(OCc2ccc3c(cc(=O)oc3c2)-c2ccc(F)cc2)c1
: