Target
Beta-glucosidase
Ligand
BDBM50182794
Substrate
Meas. Tech.
ChEMBL_344324 (CHEMBL867768)
Ki
1000±n/a nM
Citation
 Greimel, PHäusler, HLundt, IRupitz, KStütz, AETarling, CAWithers, SGWrodnigg, TM Fluorescent glycosidase inhibiting 1,5-dideoxy-1,5-iminoalditols. Bioorg Med Chem Lett 16:2067-70 (2006)  
Target
Name:
Beta-glucosidase
Synonyms:
BGLS_RHIRD | cbg-1
Type:
PROTEIN
Mol. Mass.:
88266.88
Organism:
Agrobacterium tumefaciens
Description:
ChEMBL_1366789
Residue:
818
  
Inhibitor
Name:
BDBM50182794
Synonyms:
4-(5-(4-(dimethylamino)phenyl)oxazol-2-yl)-N-(6-((2R,3R,4R,5S)-3,4,5-trihydroxy-2-(hydroxymethyl)piperidin-1-yl)hexyl)benzenesulfonamide | CHEMBL207481
Type:
Small organic molecule
Emp. Form.:
C29H40N4O7S
Mol. Mass.:
588.716
SMILES:
CN(C)c1ccc(cc1)-c1cnc(o1)-c1ccc(cc1)S(=O)(=O)NCCCCCCN1C[C@H](O)[C@@H](O)[C@H](O)[C@H]1CO
: