Target
alpha-1,2-Mannosidase
Ligand
BDBM50065259
Substrate
Meas. Tech.
ChEMBL_344325 (CHEMBL867772)
Ki
18000±n/a nM
Citation
 Greimel, PHäusler, HLundt, IRupitz, KStütz, AETarling, CAWithers, SGWrodnigg, TM Fluorescent glycosidase inhibiting 1,5-dideoxy-1,5-iminoalditols. Bioorg Med Chem Lett 16:2067-70 (2006)  
Target
Name:
alpha-1,2-Mannosidase
Synonyms:
Alpha-mannosidase
Type:
PROTEIN
Mol. Mass.:
65344.50
Organism:
Glycine max
Description:
ChEMBL_32380
Residue:
578
  
Inhibitor
Name:
BDBM50065259
Synonyms:
(2R,3R,4R,5R)-2-(Hydroxymethyl)piperidine-3,4,5-triol, 11 (2R,3R,4R,5R)-2-Hydroxymethyl-piperidine-3,4,5-triol 2-HYDROXYMETHYL-PIPERIDINE-3,4,5-TRIOL deoxymannojirimycin
Type:
Small organic molecule
Emp. Form.:
C6H13NO4
Mol. Mass.:
163.1717
SMILES:
OC[C@H]1NC[C@@H](O)[C@@H](O)[C@@H]1O
: