Target
Beta-secretase 1
Ligand
BDBM50182873
Substrate
Meas. Tech.
ChEMBL_351789 (CHEMBL867800)
IC50
6.6±n/a nM
Citation
 Kimura, THamada, YStochaj, MIkari, HNagamine, AAbdel-Rahman, HIgawa, NHidaka, KNguyen, JTSaito, KHayashi, YKiso, Y Design and synthesis of potent beta-secretase (BACE1) inhibitors with P1' carboxylic acid bioisosteres. Bioorg Med Chem Lett 16:2380-6 (2006)  
Target
Name:
Beta-secretase 1
Synonyms:
ASP2 Aspartyl protease 2 BACE1 Beta-secretase (BACE) Beta-secretase 1 (BACE 1) Beta-secretase 1 (BACE1) Beta-site amyloid precursor protein cleaving enzyme 1 Memapsin-2 beta-Secretase (BACE-1) | beta-Secretase (BACE1)
Type:
Protein
Mol. Mass.:
55755.10
Organism:
Homo sapiens (Human)
Description:
P56817
Residue:
501
  
Inhibitor
Name:
BDBM50182873
Synonyms:
CHEMBL205333 | N-((S)-2-amino-3-((S)-1-((S)-1-((2S,3R)-3-hydroxy-4-oxo-4-(3-(5-oxo-4,5-dihydro-1,2,4-oxadiazol-3-yl)phenylamino)-1-phenylbutan-2-ylamino)-4-methyl-1-oxopentan-2-ylamino)-3-methyl-1-oxobutan-2-ylamino)-3-oxopropyl)-2H-tetrazole-5-carboxamide
Type:
Small organic molecule
Emp. Form.:
C34H44N12O8
Mol. Mass.:
748.7888
SMILES:
CC(C)C[C@H](NC(=O)[C@@H](NC(=O)[C@@H](N)CNC(=O)c1nnn[nH]1)C(C)C)C(=O)N[C@@H](Cc1ccccc1)[C@@H](O)C(=O)Nc1cccc(c1)-c1nc(=O)o[nH]1
: