Target
Mu-type opioid receptor
Ligand
BDBM50182943
Substrate
Meas. Tech.
ChEMBL_349386 (CHEMBL863863)
Ki
1.4±n/a nM
Citation
 Breslin, HJCai, CMiskowski, TACoutinho, SVZhang, SPHornby, PHe, W Identification of potent phenyl imidazoles as opioid receptor agonists. Bioorg Med Chem Lett 16:2505-8 (2006)  
Target
Name:
Mu-type opioid receptor
Synonyms:
MOR-1 Mu-type opioid receptor (MOR) OPRM_RAT Opioid receptor B Ror-b
Type:
G Protein-Coupled Receptor (GPCR)
Mol. Mass.:
44503.11
Organism:
Rattus norvegicus (rat)
Description:
Competition binding assays were carried out using membrane preparations from transfected HN9.10 cells that constitutively expressed the mu opioid receptor.
Residue:
398
  
Inhibitor
Name:
BDBM50182943
Synonyms:
4-((S)-2-amino-3-oxo-3-((S)-3-(4-phenyl-1H-imidazol-2-yl)-3,4-dihydroisoquinolin-2(1H)-yl)propyl)-3,5-dimethylbenzamide | CHEMBL427214
Type:
Small organic molecule
Emp. Form.:
C30H31N5O2
Mol. Mass.:
493.5994
SMILES:
Cc1cc(cc(C)c1C[C@H](N)C(=O)N1Cc2ccccc2C[C@H]1c1nc(c[nH]1)-c1ccccc1)C(N)=O
: