Target
Cytochrome P450 2J2
Ligand
BDBM50183087
Substrate
Meas. Tech.
ChEMBL_350781 (CHEMBL869679)
IC50
6700±n/a nM
Citation
 Lafite, PDijols, SBuisson, DMacherey, ACZeldin, DCDansette, PMMansuy, D Design and synthesis of selective, high-affinity inhibitors of human cytochrome P450 2J2. Bioorg Med Chem Lett 16:2777-80 (2006)  
Target
Name:
Cytochrome P450 2J2
Synonyms:
CP2J2_HUMAN | CYP2J2
Type:
Enzyme
Mol. Mass.:
57623.04
Organism:
Homo sapiens (Human)
Description:
P51589
Residue:
502
  
Inhibitor
Name:
BDBM50183087
Synonyms:
1-(benzo[d][1,3]dioxol-5-yl)-4-(4-(hydroxydiphenylmethyl)piperidin-1-yl)butan-1-one | CHEMBL382604
Type:
Small organic molecule
Emp. Form.:
C29H31NO4
Mol. Mass.:
457.5607
SMILES:
OC(C1CCN(CCCC(=O)c2ccc3OCOc3c2)CC1)(c1ccccc1)c1ccccc1
: