Target
Sodium-dependent serotonin transporter
Ligand
BDBM50183166
Substrate
Meas. Tech.
ChEMBL_355134 (CHEMBL853187)
Ki
0.99±n/a nM
Citation
 Boot, JRBoulet, SLClark, BPCases-Thomas, MJDelhaye, LDiker, KFairhurst, JFindlay, JGallagher, PTGilmore, JHarris, JRMasters, JJMitchell, SNNaik, MSimmonds, RGSmith, SMRichards, SJTimms, GHWhatton, MAWolfe, CNWood, VA N-Alkyl-N-arylmethylpiperidin-4-amines: novel dual inhibitors of serotonin and norepinephrine reuptake. Bioorg Med Chem Lett 16:2714-8 (2006)  
Target
Name:
Sodium-dependent serotonin transporter
Synonyms:
5-HT Transporter 5HTT SC6A4_HUMAN SLC6A4 Serotonin transporter (5HTT) Sodium-dependent serotonin transporter (SERT) | Solute carrier family 6 member 4
Type:
Multi-pass membrane protein
Mol. Mass.:
70322.51
Organism:
Homo sapiens (Human)
Description:
P31645
Residue:
630
  
Inhibitor
Name:
BDBM50183166
Synonyms:
CHEMBL380191 | isobutyl-(4-methyl-benzyl)-piperidin-4-yl-amine
Type:
Small organic molecule
Emp. Form.:
C17H28N2
Mol. Mass.:
260.4176
SMILES:
CC(C)CN(Cc1ccc(C)cc1)C1CCNCC1
: