Target
Sodium-dependent noradrenaline transporter
Ligand
BDBM50183131
Substrate
Meas. Tech.
ChEMBL_355136 (CHEMBL853189)
Ki
2.2±n/a nM
Citation
 Boot, JRBoulet, SLClark, BPCases-Thomas, MJDelhaye, LDiker, KFairhurst, JFindlay, JGallagher, PTGilmore, JHarris, JRMasters, JJMitchell, SNNaik, MSimmonds, RGSmith, SMRichards, SJTimms, GHWhatton, MAWolfe, CNWood, VA N-Alkyl-N-arylmethylpiperidin-4-amines: novel dual inhibitors of serotonin and norepinephrine reuptake. Bioorg Med Chem Lett 16:2714-8 (2006)  
Target
Name:
Sodium-dependent noradrenaline transporter
Synonyms:
Monoamine transporter NET Noradrenaline Transporter (NET) Norepinephrine transporter protein (NET) SLC6A2 Sodium-dependent noradrenaline transporter (NET) | Solute carrier family 6 member 2
Type:
Multi-pass membrane protein
Mol. Mass.:
69337.72
Organism:
Homo sapiens (Human)
Description:
P23975
Residue:
617
  
Inhibitor
Name:
BDBM50183131
Synonyms:
CHEMBL208232 | N-(2-fluoro-4-(trifluoromethyl)benzyl)-N-isobutylpiperidin-4-amine fumaric acid salt
Type:
Small organic molecule
Emp. Form.:
C17H24F4N2
Mol. Mass.:
332.3795
SMILES:
CC(C)CN(Cc1ccc(cc1F)C(F)(F)F)C1CCNCC1
: