Target
Sodium-dependent serotonin transporter
Ligand
BDBM50183546
Substrate
Meas. Tech.
ChEMBL_335143 (CHEMBL867623)
Ki
30±n/a nM
Citation
 Greiner, EBoos, TLPrisinzano, TEDe Martino, MGZeglis, BDersch, CMMarcus, JPartilla, JSRothman, RBJacobson, AERice, KC Design and synthesis of promiscuous high-affinity monoamine transporter ligands: unraveling transporter selectivity. J Med Chem 49:1766-72 (2006)  
Target
Name:
Sodium-dependent serotonin transporter
Synonyms:
5-HT Transporter 5HTT SC6A4_HUMAN SLC6A4 Serotonin transporter (5HTT) Sodium-dependent serotonin transporter (SERT) | Solute carrier family 6 member 4
Type:
Multi-pass membrane protein
Mol. Mass.:
70322.51
Organism:
Homo sapiens (Human)
Description:
P31645
Residue:
630
  
Inhibitor
Name:
BDBM50183546
Synonyms:
CHEMBL383071 | S-(+)-4-[2-[bis-(4-fluorophenyl)methoxy]ethyl]-1-(3-phenylbutyl)-piperidine oxalate
Type:
Small organic molecule
Emp. Form.:
C30H35F2NO
Mol. Mass.:
463.6018
SMILES:
C[C@@H](CCN1CCC(CCOC(c2ccc(F)cc2)c2ccc(F)cc2)CC1)c1ccccc1
: