Target
UDP-glucuronosyltransferase 2B17
Ligand
BDBM50183609
Substrate
Meas. Tech.
ChEMBL_339084 (CHEMBL869551)
Ki
1440000±n/a nM
Citation
 Bichlmaier, ISiiskonen, AFinel, MYli-Kauhaluoma, J Stereochemical sensitivity of the human UDP-glucuronosyltransferases 2B7 and 2B17. J Med Chem 49:1818-27 (2006)  
Target
Name:
UDP-glucuronosyltransferase 2B17
Synonyms:
UDB17_HUMAN | UGT2B17
Type:
PROTEIN
Mol. Mass.:
61109.88
Organism:
Homo sapiens (Human)
Description:
ChEMBL_436440
Residue:
530
  
Inhibitor
Name:
BDBM50183609
Synonyms:
(rac)-6-methyl-2,3-dihydro-1H-inden-1-ol | CHEMBL202791
Type:
Small organic molecule
Emp. Form.:
C10H12O
Mol. Mass.:
148.2017
SMILES:
Cc1ccc2CCC(O)c2c1
: