Target
Alpha-1D adrenergic receptor
Ligand
BDBM50183678
Substrate
Meas. Tech.
ChEMBL_350832 (CHEMBL869686)
EC50
1900±n/a nM
Citation
 del Olmo, EBarboza, BYbarra, MILópez-Pérez, JLCarrón, RSevilla, MABoselli, CSan Feliciano, A Vasorelaxant activity of phthalazinones and related compounds. Bioorg Med Chem Lett 16:2786-90 (2006)  
Target
Name:
Alpha-1D adrenergic receptor
Synonyms:
ADA1D_RAT Adra1d Alpha-1D adrenergic receptor | Serotonin 1a (5-HT1a) receptor/Adrenergic receptor alpha-1
Type:
Protein
Mol. Mass.:
59375.97
Organism:
Rattus norvegicus (Rat)
Description:
P23944
Residue:
561
  
Inhibitor
Name:
BDBM50183678
Synonyms:
4-(2-chlorobenzyl)phthalazin-1(2H)-one | CHEMBL378274
Type:
Small organic molecule
Emp. Form.:
C15H11ClN2O
Mol. Mass.:
270.714
SMILES:
Clc1ccccc1Cc1n[nH]c(=O)c2ccccc12
: