Target
Disintegrin and metalloproteinase domain-containing protein 17
Ligand
BDBM50183741
Substrate
Meas. Tech.
ChEMBL_354454 (CHEMBL865120)
IC50
>3000±n/a nM
Citation
 Gilmore, JLKing, BWHarris, CMaduskuie, TMercer, SELiu, RQCovington, MBQian, MRibadeneria, MDVaddi, KTrzaskos, JMNewton, RCDecicco, CPDuan, JJ Synthesis and structure-activity relationship of a novel, achiral series of TNF-alpha converting enzyme inhibitors. Bioorg Med Chem Lett 16:2699-704 (2006)  
Target
Name:
Disintegrin and metalloproteinase domain-containing protein 17
Synonyms:
ADA17_HUMAN CSVP Disintegrin and metalloproteinase domain-containing protein 17 (ADAM17) TNF-alpha convertase TNF-alpha-converting enzyme (TACE) Tumor necrosis factor-α converting enzyme (TACE)
Type:
Enzyme
Mol. Mass.:
93007.89
Organism:
Homo sapiens (Human)
Description:
Residue:
824
  
Inhibitor
Name:
BDBM50183741
Synonyms:
CHEMBL204627 | N-hydroxy-4-((4-((2-methylquinolin-4-yl)methoxy)benzamido)methyl)-1-pivaloylpiperidine-4-carboxamide
Type:
Small organic molecule
Emp. Form.:
C30H36N4O5
Mol. Mass.:
532.6306
SMILES:
Cc1cc(COc2ccc(cc2)C(=O)NCC2(CCN(CC2)C(=O)C(C)(C)C)C(=O)NO)c2ccccc2n1
: