Target
Collagenase 3
Ligand
BDBM50183784
Substrate
Meas. Tech.
ChEMBL_354053 (CHEMBL870007)
Ki
0.5±n/a nM
Citation
 Janser, PNeumann, UMiltz, WFeifel, RBuhl, T A cassette-dosing approach for improvement of oral bioavailability of dual TACE/MMP inhibitors. Bioorg Med Chem Lett 16:2632-6 (2006)  
Target
Name:
Collagenase 3
Synonyms:
MMP-13 MMP13_HUMAN Matrix metalloproteinase-13 (MMP-13) | Matrix metalloproteinase-13 (MMP13)
Type:
Enzyme
Mol. Mass.:
53808.06
Organism:
Homo sapiens (Human)
Description:
P45452
Residue:
471
  
Inhibitor
Name:
BDBM50183784
Synonyms:
(2S,3R)-N1-((S)-3,3-dimethyl-1-(methylamino)-1-oxobutan-2-yl)-N4-hydroxy-3-(hydroxymethyl)-2-(4-methoxyphenyl)succinamide CHEMBL72511 PKF-242-484 | TNF-484
Type:
Small organic molecule
Emp. Form.:
C19H29N3O6
Mol. Mass.:
395.4501
SMILES:
CNC(=O)[C@@H](NC(=O)[C@@H]([C@H](CO)C(=O)NO)c1ccc(OC)cc1)C(C)(C)C
: