Target
cAMP-specific 3',5'-cyclic phosphodiesterase 4C
Ligand
BDBM50183797
Substrate
Meas. Tech.
ChEMBL_353750 (CHEMBL866913)
IC50
5.5±n/a nM
Citation
 Lacombe, PDeschênes, DDubé, DDubé, LGallant, MMacdonald, DMastracchio, APerrier, HCharleson, SHuang, ZLaliberté, FLiu, SMancini, JAMasson, PSalem, MStyhler, AGirard, Y Nitrogen-bridged substituted 8-arylquinolines as potent PDE IV inhibitors. Bioorg Med Chem Lett 16:2608-12 (2006)  
Target
Name:
cAMP-specific 3',5'-cyclic phosphodiesterase 4C
Synonyms:
3',5'-cyclic phosphodiesterase NP_000914.2 PDE4C | PDE4C1
Type:
Enzyme Catalytic Domain
Mol. Mass.:
79875.54
Organism:
Homo sapiens (Human)
Description:
Q08493
Residue:
712
  
Inhibitor
Name:
BDBM50183797
Synonyms:
CHEMBL207996 | N-(3,5-dichloropyridin-4-yl)-3-(6-(2-(methylsulfonyl)propan-2-yl)quinolin-8-yl)benzamide
Type:
Small organic molecule
Emp. Form.:
C25H21Cl2N3O3S
Mol. Mass.:
514.424
SMILES:
CC(C)(c1cc(-c2cccc(c2)C(=O)Nc2c(Cl)cncc2Cl)c2ncccc2c1)S(C)(=O)=O
: