Target
cAMP-specific 3',5'-cyclic phosphodiesterase 4C
Ligand
BDBM50183805
Substrate
Meas. Tech.
ChEMBL_353750 (CHEMBL866913)
IC50
0.05±n/a nM
Citation
 Lacombe, PDeschênes, DDubé, DDubé, LGallant, MMacdonald, DMastracchio, APerrier, HCharleson, SHuang, ZLaliberté, FLiu, SMancini, JAMasson, PSalem, MStyhler, AGirard, Y Nitrogen-bridged substituted 8-arylquinolines as potent PDE IV inhibitors. Bioorg Med Chem Lett 16:2608-12 (2006)  
Target
Name:
cAMP-specific 3',5'-cyclic phosphodiesterase 4C
Synonyms:
3',5'-cyclic phosphodiesterase NP_000914.2 PDE4C | PDE4C1
Type:
Enzyme Catalytic Domain
Mol. Mass.:
79875.54
Organism:
Homo sapiens (Human)
Description:
Q08493
Residue:
712
  
Inhibitor
Name:
BDBM50183805
Synonyms:
1-((3-(6-(2-cyanopropan-2-yl)quinolin-8-yl)phenyl)methyl)-1-(4-(methylsulfonyl)phenyl)-3-phenylurea | CHEMBL380321
Type:
Small organic molecule
Emp. Form.:
C34H30N4O3S
Mol. Mass.:
574.692
SMILES:
CC(C)(C#N)c1cc(-c2cccc(CN(C(=O)Nc3ccccc3)c3ccc(cc3)S(C)(=O)=O)c2)c2ncccc2c1
: