Target
Epidermal growth factor receptor
Ligand
BDBM50183845
Substrate
Meas. Tech.
ChEMBL_354894 (CHEMBL853149)
IC50
50±n/a nM
Citation
 Hennequin, LFBallard, PBoyle, FTDelouvrié, BEllston, RPHalsall, CTHarris, CSHudson, KKendrew, JPease, JERoss, HSSmith, PVincent, JL Novel 4-anilinoquinazolines with C-6 carbon-linked side chains: synthesis and structure-activity relationship of a series of potent, orally active, EGF receptor tyrosine kinase inhibitors. Bioorg Med Chem Lett 16:2672-6 (2006)  
Target
Name:
Epidermal growth factor receptor
Synonyms:
EGF Receptor Substrate EGFR_HUMAN ERBB1 Epidermal Growth Factor Receptor erbB-1 Epidermal growth factor receptor (EGFR) HER1 Proto-oncogene c-ErbB-1 Tyrosine-Protein Kinase ErbB-1
Type:
Receptor Kinase Domain
Mol. Mass.:
134279.59
Organism:
Homo sapiens (Human)
Description:
P00533
Residue:
1210
  
Inhibitor
Name:
BDBM50183845
Synonyms:
(R)-1-((4-(3-chloro-2-fluorophenylamino)-7-methoxyquinazolin-6-yl)methyl)-N-methylpyrrolidine-2-carboxamide | CHEMBL383760
Type:
Small organic molecule
Emp. Form.:
C22H23ClFN5O2
Mol. Mass.:
443.902
SMILES:
CNC(=O)[C@H]1CCCN1Cc1cc2c(Nc3cccc(Cl)c3F)ncnc2cc1OC
: