Target
Epidermal growth factor receptor
Ligand
BDBM50183858
Substrate
Meas. Tech.
ChEMBL_354895 (CHEMBL853150)
IC50
40±n/a nM
Citation
 Hennequin, LFBallard, PBoyle, FTDelouvrié, BEllston, RPHalsall, CTHarris, CSHudson, KKendrew, JPease, JERoss, HSSmith, PVincent, JL Novel 4-anilinoquinazolines with C-6 carbon-linked side chains: synthesis and structure-activity relationship of a series of potent, orally active, EGF receptor tyrosine kinase inhibitors. Bioorg Med Chem Lett 16:2672-6 (2006)  
Target
Name:
Epidermal growth factor receptor
Synonyms:
EGF Receptor Substrate EGFR_HUMAN ERBB1 Epidermal Growth Factor Receptor erbB-1 Epidermal growth factor receptor (EGFR) HER1 Proto-oncogene c-ErbB-1 Tyrosine-Protein Kinase ErbB-1
Type:
Receptor Kinase Domain
Mol. Mass.:
134279.59
Organism:
Homo sapiens (Human)
Description:
P00533
Residue:
1210
  
Inhibitor
Name:
BDBM50183858
Synonyms:
4-(((4-(3-chloro-2-fluorophenylamino)-7-methoxyquinazolin-6-yl)methyl)(methyl)amino)-1-methylpiperidine-4-carboxamide | CHEMBL207130
Type:
Small organic molecule
Emp. Form.:
C24H28ClFN6O2
Mol. Mass.:
486.97
SMILES:
COc1cc2ncnc(Nc3cccc(Cl)c3F)c2cc1CN(C)C1(CCN(C)CC1)C(N)=O
: