Target
Coagulation factor XI
Ligand
BDBM50228892
Substrate
Meas. Tech.
ChEMBL_364595 (CHEMBL854192)
IC50
850±n/a nM
Citation
 Deng, HBannister, TDJin, LBabine, REQuinn, JNagafuji, PCelatka, CALin, JLazarova, TIRynkiewicz, MJBibbins, FPandey, PGorga, JMeyers, HVAbdel-Meguid, SSStrickler, JE Synthesis, SAR exploration, and X-ray crystal structures of factor XIa inhibitors containing an alpha-ketothiazole arginine. Bioorg Med Chem Lett 16:3049-54 (2006)  
Target
Name:
Coagulation factor XI
Synonyms:
Coagulation factor XIa Coagulation factor XIa light chain FA11_HUMAN Factor XIa PTA | Plasma thromboplastin antecedent
Type:
Enzyme
Mol. Mass.:
70130.58
Organism:
Homo sapiens (Human)
Description:
P03951
Residue:
625
  
Inhibitor
Name:
BDBM50228892
Synonyms:
4-methyl-pentanoic acid {(S)-1-[(S)-4-guanidino-1-(thiazole-2-carbonyl)-butylcarbamoyl]-2-methyl-propyl}-amide N-((S)-1-((S)-5-guanidino-1-oxo-1-(thiazol-2-yl)pentan-2-ylamino)-3-methyl-1-oxobutan-2-yl)-4-methylpentanamide
Type:
Small organic molecule
Emp. Form.:
C20H34N6O3S
Mol. Mass.:
438.587
SMILES:
[#6]-[#6](-[#6])-[#6]-[#6]-[#6](=O)-[#7]-[#6@@H](-[#6](-[#6])-[#6])-[#6](=O)-[#7]-[#6@@H](-[#6]-[#6]-[#6]\[#7]=[#6](\[#7])-[#7])-[#6](=O)-c1nccs1
: