Target
Calcitonin gene-related peptide type 1 receptor/Receptor activity-modifying protein 1
Ligand
BDBM50184076
Substrate
Meas. Tech.
ChEMBL_353840 (CHEMBL864503)
IC50
1810±n/a nM
Citation
 Williams, TMStump, CANguyen, DNQuigley, AGBell, IMGallicchio, SNZartman, CBWan, BLPenna, KDKunapuli, PKane, SAKoblan, KSMosser, SDRutledge, RZSalvatore, CFay, JFVacca, JPGraham, SL Non-peptide calcitonin gene-related peptide receptor antagonists from a benzodiazepinone lead. Bioorg Med Chem Lett 16:2595-8 (2006)  
Target
Name:
Calcitonin gene-related peptide type 1 receptor/Receptor activity-modifying protein 1
Synonyms:
Calcitonin-gene-related peptide receptor, CALCRL/RAMP1
Type:
Mol. Mass.:
Description:
ASSAY_ID of EBI is 327200
Components:
This complex has 2 components.
Component 1
Name:
Calcitonin gene-related peptide type 1 receptor
Synonyms:
Adrenomedullin receptor AM1; CALCRL/RAMP2 CALRL_HUMAN CGRP type 1 receptor mRNA Calcitonin gene-related peptide (CGRP) receptor Calcitonin receptor-like receptor Human CL receptor
Type:
Enzyme Catalytic Domain
Mol. Mass.:
52980.45
Organism:
Homo sapiens (Human)
Description:
Q16602
Residue:
461
  
Component 2
Name:
Receptor activity-modifying protein 1
Synonyms:
Calcitonin-gene-related peptide receptor, CALCRL/RAMP1 RAMP1_HUMAN
Type:
PROTEIN
Mol. Mass.:
16992.80
Organism:
Homo sapiens (Human)
Description:
EBI_100673
Residue:
148
  
Inhibitor
Name:
BDBM50184076
Synonyms:
(R,S)-N-(1-isopropyl-2-oxo-5-phenyl-2,3-dihydro-1H-benzo[e][1,4]diazepin-3-yl)-4-(2-oxo-1,2-dihydroquinazolin-3(4H)-yl)piperidine-1-carboxamide | CHEMBL380514
Type:
Small organic molecule
Emp. Form.:
C32H34N6O3
Mol. Mass.:
550.6508
SMILES:
CC(C)N1c2ccccc2C(=NC(NC(=O)N2CCC(CC2)N2Cc3ccccc3NC2=O)C1=O)c1ccccc1
: