Target
B1 bradykinin receptor
Ligand
BDBM50184190
Substrate
Meas. Tech.
ChEMBL_350972 (CHEMBL858907)
Ki
1.5±n/a nM
Citation
 Kuduk, SDDi Marco, CNChang, RKWood, MRKim, JJSchirripa, KMMurphy, KLRansom, RWTang, CTorrent, MHa, SPrueksaritanont, TPettibone, DJBock, MG 5-Piperazinyl pyridine carboxamide bradykinin B1 antagonists. Bioorg Med Chem Lett 16:2791-5 (2006)  
Target
Name:
B1 bradykinin receptor
Synonyms:
B1 BRADYKININ B1R BK-1 receptor BRADYB1 | Bradykinin B1 receptor
Type:
Enzyme
Mol. Mass.:
40508.87
Organism:
Homo sapiens (Human)
Description:
P46663
Residue:
353
  
Inhibitor
Name:
BDBM50184190
Synonyms:
3,3'-difluoro-4'-{[5-(4-isobutyl-piperazine-1-carbonyl)-pyridin-2-ylamino]-methyl}-biphenyl-2-carboxylic acid methyl ester | CHEMBL381974
Type:
Small organic molecule
Emp. Form.:
C29H32F2N4O3
Mol. Mass.:
522.5862
SMILES:
COC(=O)c1c(F)cccc1-c1ccc(CNc2ccc(cn2)C(=O)N2CCN(CC(C)C)CC2)c(F)c1
: