Target
B1 bradykinin receptor
Ligand
BDBM50184201
Substrate
Meas. Tech.
ChEMBL_350972 (CHEMBL858907)
Ki
1.5±n/a nM
Citation
 Kuduk, SDDi Marco, CNChang, RKWood, MRKim, JJSchirripa, KMMurphy, KLRansom, RWTang, CTorrent, MHa, SPrueksaritanont, TPettibone, DJBock, MG 5-Piperazinyl pyridine carboxamide bradykinin B1 antagonists. Bioorg Med Chem Lett 16:2791-5 (2006)  
Target
Name:
B1 bradykinin receptor
Synonyms:
B1 BRADYKININ B1R BK-1 receptor BRADYB1 | Bradykinin B1 receptor
Type:
Enzyme
Mol. Mass.:
40508.87
Organism:
Homo sapiens (Human)
Description:
P46663
Residue:
353
  
Inhibitor
Name:
BDBM50184201
Synonyms:
4'-{[5-(4-sec-butyl-piperazine-1-carbonyl)-pyridin-2-ylamino]-methyl}-3,3'-difluoro-biphenyl-2-carboxylica acid methyl ester | CHEMBL208991
Type:
Small organic molecule
Emp. Form.:
C29H32F2N4O3
Mol. Mass.:
522.5862
SMILES:
CCC(C)N1CCN(CC1)C(=O)c1ccc(NCc2ccc(cc2F)-c2cccc(F)c2C(=O)OC)nc1
: