Target
Thromboxane A2 receptor
Ligand
BDBM50184244
Substrate
Meas. Tech.
ChEMBL_364758 (CHEMBL871220)
Ki
2.2±n/a nM
Citation
 Sturino, CFLachance, NBoyd, MBerthelette, CLabelle, MLi, LRoy, BScheigetz, JTsou, NBrideau, CCauchon, ECarriere, MCDenis, DGreig, GKargman, SLamontagne, SMathieu, MCSawyer, NSlipetz, DO'Neill, GWang, ZZamboni, RMetters, KMYoung, RN Identification of an indole series of prostaglandin D2 receptor antagonists. Bioorg Med Chem Lett 16:3043-8 (2006)  
Target
Name:
Thromboxane A2 receptor
Synonyms:
Prostanoid TP receptor TBXA2R Thromboxane Thromboxane Beta
Type:
Enyzme
Mol. Mass.:
37445.28
Organism:
Homo sapiens (Human)
Description:
P21731
Residue:
343
  
Inhibitor
Name:
BDBM50184244
Synonyms:
2-(9-(4-chlorobenzyl)-8-bromo-2,3,4,9-tetrahydro-1H-carbazol-1-yl)acetic acid | CHEMBL378125
Type:
Small organic molecule
Emp. Form.:
C21H19BrClNO2
Mol. Mass.:
432.738
SMILES:
OC(=O)CC1CCCc2c1n(Cc1ccc(Cl)cc1)c1c(Br)cccc21
: