Target
Oxysterols receptor LXR-beta
Ligand
BDBM50184268
Substrate
Meas. Tech.
ChEMBL_364820 (CHEMBL870849)
IC50
199±n/a nM
Citation
 Szewczyk, JWHuang, SChin, JTian, JMitnaul, LRosa, RLPeterson, LSparrow, CPAdams, AD SAR studies: designing potent and selective LXR agonists. Bioorg Med Chem Lett 16:3055-60 (2006)  
Target
Name:
Oxysterols receptor LXR-beta
Synonyms:
LXRB Liver X, LXR beta NR1H2 Nuclear receptor NER Ubiquitously-expressed nuclear receptor
Type:
Enzyme Catalytic Domain
Mol. Mass.:
50978.79
Organism:
Homo sapiens (Human)
Description:
P55055
Residue:
460
  
Inhibitor
Name:
BDBM50184268
Synonyms:
1-(3-(7-propyl-3-(trifluoromethyl)benzo[d]isoxazol-6-yloxy)propyl)-1H-indole-5-carboxylic acid | CHEMBL377218
Type:
Small organic molecule
Emp. Form.:
C23H21F3N2O4
Mol. Mass.:
446.419
SMILES:
CCCc1c(OCCCn2ccc3cc(ccc23)C(O)=O)ccc2c(noc12)C(F)(F)F
: