Target
Oxysterols receptor LXR-beta
Ligand
BDBM50184274
Substrate
Meas. Tech.
ChEMBL_364820 (CHEMBL870849)
IC50
89±n/a nM
Citation
 Szewczyk, JWHuang, SChin, JTian, JMitnaul, LRosa, RLPeterson, LSparrow, CPAdams, AD SAR studies: designing potent and selective LXR agonists. Bioorg Med Chem Lett 16:3055-60 (2006)  
Target
Name:
Oxysterols receptor LXR-beta
Synonyms:
LXRB Liver X, LXR beta NR1H2 Nuclear receptor NER Ubiquitously-expressed nuclear receptor
Type:
Enzyme Catalytic Domain
Mol. Mass.:
50978.79
Organism:
Homo sapiens (Human)
Description:
P55055
Residue:
460
  
Inhibitor
Name:
BDBM50184274
Synonyms:
2-(4-(3-(7-propyl-3-(trifluoromethyl)benzo[d]isoxazol-6-yloxy)propylamino)phenyl)acetic acid | CHEMBL207103
Type:
Small organic molecule
Emp. Form.:
C22H23F3N2O4
Mol. Mass.:
436.4242
SMILES:
CCCc1c(OCCCNc2ccc(CC(O)=O)cc2)ccc2c(noc12)C(F)(F)F
: