Target
Peroxisome proliferator-activated receptor delta
Ligand
BDBM50184253
Substrate
Meas. Tech.
ChEMBL_364829 (CHEMBL870176)
IC50
93±n/a nM
Citation
 Szewczyk, JWHuang, SChin, JTian, JMitnaul, LRosa, RLPeterson, LSparrow, CPAdams, AD SAR studies: designing potent and selective LXR agonists. Bioorg Med Chem Lett 16:3055-60 (2006)  
Target
Name:
Peroxisome proliferator-activated receptor delta
Synonyms:
NR1C2 NUCI Nuclear receptor subfamily 1 group C member 2 PPAR-beta PPARD Peroxisome proliferator-activated receptor Peroxisome proliferator-activated receptor delta
Type:
Enzyme
Mol. Mass.:
49910.45
Organism:
Homo sapiens (Human)
Description:
Q03181
Residue:
441
  
Inhibitor
Name:
BDBM50184253
Synonyms:
2-(3-(methyl(3-(7-propyl-3-(trifluoromethyl)benzo[d]isoxazol-6-yloxy)propyl)amino)phenyl)acetic acid | CHEMBL207442
Type:
Small organic molecule
Emp. Form.:
C23H25F3N2O4
Mol. Mass.:
450.4508
SMILES:
CCCc1c(OCCCN(C)c2cccc(CC(O)=O)c2)ccc2c(noc12)C(F)(F)F
: