Target
Oxysterols receptor LXR-alpha
Ligand
BDBM50184270
Substrate
Meas. Tech.
ChEMBL_364822 (CHEMBL870169)
EC50
620±n/a nM
Citation
 Szewczyk, JWHuang, SChin, JTian, JMitnaul, LRosa, RLPeterson, LSparrow, CPAdams, AD SAR studies: designing potent and selective LXR agonists. Bioorg Med Chem Lett 16:3055-60 (2006)  
Target
Name:
Oxysterols receptor LXR-alpha
Synonyms:
LXRA Liver X receptor alpha Liver X receptor alpha (NR1H3) NR1H3 Nuclear orphan receptor LXR-alpha | Nuclear receptor subfamily 1 group H member 3
Type:
Enzyme Catalytic Domain
Mol. Mass.:
50403.85
Organism:
Homo sapiens (Human)
Description:
Q13133
Residue:
447
  
Inhibitor
Name:
BDBM50184270
Synonyms:
2-(2-(methyl(3-(7-propyl-3-(trifluoromethyl)benzo[d]isoxazol-6-yloxy)propyl)amino)pyrimidin-5-yl)acetic acid | CHEMBL210990
Type:
Small organic molecule
Emp. Form.:
C21H23F3N4O4
Mol. Mass.:
452.4269
SMILES:
CCCc1c(OCCCN(C)c2ncc(CC(O)=O)cn2)ccc2c(noc12)C(F)(F)F
: