Target
Inositol 1,4,5-trisphosphate receptor type 1
Ligand
BDBM50075183
Substrate
Meas. Tech.
ChEMBL_337345 (CHEMBL867179)
EC50
24.8±n/a nM
Citation
 Terauchi, MAbe, HTovey, SCDedos, SGTaylor, CWPaul, MTrusselle, MPotter, BVMatsuda, AShuto, S A systematic study of C-glucoside trisphosphates as myo-inositol trisphosphate receptor ligands. Synthesis of beta-C-glucoside trisphosphates based on the conformational restriction strategy. J Med Chem 49:1900-9 (2006)  
Target
Name:
Inositol 1,4,5-trisphosphate receptor type 1
Synonyms:
ITPR1_RAT Itpr1
Type:
PROTEIN
Mol. Mass.:
313234.63
Organism:
Rattus norvegicus
Description:
ChEMBL_818416
Residue:
2750
  
Inhibitor
Name:
BDBM50075183
Synonyms:
1,4,5-Insp3 1D-myo-inositol 1,4,5-tris(dihydrogen phosphate) 3,5,6-trioxyphosphate-1,2,4-cyclohexanetriol D-myo-inositol 1,4,5-trisphosphate InsP3
Type:
Small organic molecule
Emp. Form.:
C6H15O15P3
Mol. Mass.:
420.0956
SMILES:
O[C@@H]1[C@H](O)[C@@H](OP(O)(O)=O)[C@H](OP(O)(O)=O)[C@@H](O)[C@@H]1OP(O)(O)=O
: