Target
Inositol 1,4,5-trisphosphate receptor type 1
Ligand
BDBM50184327
Substrate
Meas. Tech.
ChEMBL_337345 (CHEMBL867179)
EC50
4430±n/a nM
Citation
 Terauchi, MAbe, HTovey, SCDedos, SGTaylor, CWPaul, MTrusselle, MPotter, BVMatsuda, AShuto, S A systematic study of C-glucoside trisphosphates as myo-inositol trisphosphate receptor ligands. Synthesis of beta-C-glucoside trisphosphates based on the conformational restriction strategy. J Med Chem 49:1900-9 (2006)  
Target
Name:
Inositol 1,4,5-trisphosphate receptor type 1
Synonyms:
ITPR1_RAT Itpr1
Type:
PROTEIN
Mol. Mass.:
313234.63
Organism:
Rattus norvegicus
Description:
ChEMBL_818416
Residue:
2750
  
Inhibitor
Name:
BDBM50184327
Synonyms:
CHEMBL205303 | phosphoric acid mono-[(2R,3R,4R,5S,6S)-5-hydroxy-2-hydroxymethyl-4-phosphonooxy-6-(3-phosphonooxy-propyl)-tetrahydro-pyran-3-yl] ester
Type:
Small organic molecule
Emp. Form.:
C9H21O15P3
Mol. Mass.:
462.1753
SMILES:
OC[C@H]1O[C@@H](CCCOP(O)(O)=O)[C@H](O)[C@@H](OP(O)(O)=O)[C@@H]1OP(O)(O)=O
: